Target
Bcl-2-like protein 1
Ligand
BDBM552909
Substrate
Meas. Tech.
Bcl-2 Protein Family Binding Assay
Kd
>100±n/a nM
Citation
 Pinchman, JRHuang, PQBunker, KDSit, RKSamatar, AA Benzamide compounds US Patent  US11590126 Publication Date 2/28/2023 
Target
Name:
Bcl-2-like protein 1
Synonyms:
Anti-apoptotic Bcl-2 protein Apoptosis regulator Bcl-X BCL2-like 1 isoform 1 BCL2L1 Bcl-2-like protein 1 (Bcl-XL) Bcl-xL/Bcl-2-binding component 3 Bcl2-antagonist of cell death (BAD)
Type:
Mitochondrion membrane; Single-pass membrane protein
Mol. Mass.:
26039.60
Organism:
Homo sapiens (Human)
Description:
Residue:
233
  
Inhibitor
Name:
BDBM552909
Synonyms:
2-((1H-pyrrolo[2,3-b]pyridin-5-yl)oxy)-N-((4-(((7-oxaspiro[3.5]nonan-2-yl)methyl)amino)-3-nitrophenyl)sulfonyl)-4-(4-((4,4-dimethyl-2-(3-methylbicyclo[1.1.1]pentan-1-yl)cyclohex-1-en-1-yl)methyl)piperazin-1-yl)benzamide US11344546, Example 11 | US11590126, Example 11
Type:
Small organic molecule
Emp. Form.:
C48H59N7O7S
Mol. Mass.:
878.09
SMILES:
CC12CC(C1)(C2)C1=C(CN2CCN(CC2)c2ccc(C(=O)NS(=O)(=O)c3ccc(NCC4CC5(C4)CCOCC5)c(c3)[N+]([O-])=O)c(Oc3cnc4[nH]ccc4c3)c2)CCC(C)(C)C1
: