Target
Bcl-2-like protein 1
Ligand
BDBM552930
Substrate
Meas. Tech.
Bcl-2 Protein Family Binding Assay
Kd
55±n/a nM
Citation
 Pinchman, JRHuang, PQBunker, KDSit, RKSamatar, AA Benzamide compounds US Patent  US11590126 Publication Date 2/28/2023 
Target
Name:
Bcl-2-like protein 1
Synonyms:
Anti-apoptotic Bcl-2 protein Apoptosis regulator Bcl-X BCL2-like 1 isoform 1 BCL2L1 Bcl-2-like protein 1 (Bcl-XL) Bcl-xL/Bcl-2-binding component 3 Bcl2-antagonist of cell death (BAD)
Type:
Mitochondrion membrane; Single-pass membrane protein
Mol. Mass.:
26039.60
Organism:
Homo sapiens (Human)
Description:
Residue:
233
  
Inhibitor
Name:
BDBM552930
Synonyms:
(R)-4-(4-((5,5-Dimethyl-2-(3-methylbicyclo[1.1.1]pentan-1-yl)cyclohex-1-enyl)methyl)piperazin-1-yl)-N-(4-(4-morpholino-1-(phenylthio)butan-2-ylamino)-3-(trifluoromethylsulfonyl)phenylsulfonyl)benzamide US11344546, Example 47 | US11590126, Example 47
Type:
Small organic molecule
Emp. Form.:
C47H60F3N5O6S3
Mol. Mass.:
944.199
SMILES:
CC12CC(C1)(C2)C1=C(CN2CCN(CC2)c2ccc(cc2)C(=O)NS(=O)(=O)c2ccc(N[C@H](CCN3CCOCC3)CSc3ccccc3)c(c2)S(=O)(=O)C(F)(F)F)CC(C)(C)CC1
: