Target
Acetylcholinesterase
Ligand
BDBM9014
Substrate
BDBM8959
Meas. Tech.
Cholinesterase Inhibition Assay
IC50
0.65±n/a nM
Citation
 Rodriguez-Franco, MIFernandez-Bachiller, MIPerez, CHernandez-Ledesma, BBartolome, B Novel tacrine-melatonin hybrids as dual-acting drugs for Alzheimer disease, with improved acetylcholinesterase inhibitory and antioxidant properties. J Med Chem 49:459-62 (2006)  
Target
Name:
Acetylcholinesterase
Synonyms:
ACES_HUMAN Acetylcholinesterase (AChE) | Acetylcholinesterase (human AChE)
Type:
Enzyme
Mol. Mass.:
67792.70
Organism:
Homo sapiens (Human)
Description:
P22303
Residue:
614
  
Inhibitor
Name:
BDBM9014
Synonyms:
7-(1,2,3,4-Tetrahydro-acridin-9-ylamino)-heptanoic acid [2-(1H-indol-5-metoxy-3-yl)-ethyl]-amide Tacrine-Melatonin Hybrid 7b
Type:
Small organic molecule
Emp. Form.:
C31H38N4O2
Mol. Mass.:
498.659
SMILES:
COc1ccc2[nH]cc(CCNC(=O)CCCCCCNc3c4CCCCc4nc4ccccc34)c2c1
:
Substrate
Name:
BDBM8959
Synonyms:
(2-Mercaptoethyl)trimethylammonium iodide acetate Acetylthiocholine acetylthiocholine chloride | acetylthiocholine iodide
Type:
Small organic molecule
Emp. Form.:
C7H16NOS
Mol. Mass.:
162.272
SMILES:
CC(=O)SCC[N+](C)(C)C
: