Target
C-C chemokine receptor type 3
Ligand
BDBM123082
Substrate
Meas. Tech.
Scintillation Proximity Assay
Ki
2.30±n/a nM
Citation
 Fetscher, AScher, JM Pharmaceutical formulations comprising CCR3 antagonists US Patent  US11612596 Publication Date 3/28/2023 
Target
Name:
C-C chemokine receptor type 3
Synonyms:
C-C CKR-3 CC-CKR-3 CCR3 CD_antigen=CD193 CMKBR3 | Eosinophil eotaxin receptor
Type:
Enzyme
Mol. Mass.:
41053.88
Organism:
Homo sapiens (Human)
Description:
P51677
Residue:
355
  
Inhibitor
Name:
BDBM123082
Synonyms:
US10213421, Example 8 US8742115, 22
Type:
Small organic molecule
Emp. Form.:
C29H38ClN5O3
Mol. Mass.:
540.097
SMILES:
CC(C)N(C)C(=O)c1cc(C)nc(NC(=O)[C@H]2CCC(=O)N2C2CCN(Cc3ccc(Cl)c(C)c3)CC2)c1
: