Target
Isocitrate dehydrogenase [NADP] cytoplasmic [R132C]
Ligand
BDBM600742
Substrate
Meas. Tech.
Biochemical Assays for IDH1 and IDH2 Mutant Enzymes
IC50
8.69±n/a nM
Citation
 Bauer, RABoulet, SLBurkholder, TPGilmour, RHahn, PJRankovic, Z 7-phenylethylamino-4H-pyrimido[4,5-d][1,3]oxazin-2-one compounds as mutant IDH1 and IDH2 inhibitors US Patent  US11629156 Publication Date 4/18/2023 
Target
Name:
Isocitrate dehydrogenase [NADP] cytoplasmic [R132C]
Synonyms:
IDH1 IDH1(R132C) Isocitrate dehydrogenase (IDH1)(R132C) Isocitrate dehydrogenase [NADP] cytoplasmic (IDH1) (R132C) | PICD
Type:
Enzyme Catalytic Domain
Mol. Mass.:
46607.23
Organism:
Homo sapiens (Human)
Description:
O75874[R132C]
Residue:
414
  
Inhibitor
Name:
BDBM600742
Synonyms:
US11629156, Example 4
Type:
Emp. Form.:
C27H34N6O3
Mol. Mass.:
490.5973
SMILES:
C[C@H](Nc1ncc2COC(=O)N(C)c2n1)c1ccc(cc1)[C@H](CC1CC1)N1CCN(CC1)C(=O)C=C
: