Target
Inward rectifier potassium channel 2
Ligand
BDBM600745
Substrate
Meas. Tech.
thallium-flux assay
IC50
11300±n/a nM
Citation
 Swale, DRFoil, LD Method for controlling hematophagous or sap-feeding arthropods US Patent  US11632953 Publication Date 4/25/2023 
Target
Name:
Inward rectifier potassium channel 2
Synonyms:
Cardiac inward rectifier potassium channel IRK1 KCNJ2 Potassium channel, inwardly rectifying subfamily J member 2 | hIRK1
Type:
PROTEIN
Mol. Mass.:
48281.20
Organism:
Homo sapiens (Human)
Description:
ChEMBL_1515520
Residue:
427
  
Inhibitor
Name:
BDBM600745
Synonyms:
US11632953, Compound 1 | US11632953, Compound VU041
Type:
Small organic molecule
Emp. Form.:
C19H20F3N3O
Mol. Mass.:
363.3768
SMILES:
FC(F)(F)c1nn(CC(=O)N2CCCc3ccccc23)c2CCCCc12
: