Target
Inward rectifier potassium channel 2
Ligand
BDBM600747
Substrate
Meas. Tech.
thallium-flux assay
IC50
>30000±n/a nM
Citation
 Swale, DRFoil, LD Method for controlling hematophagous or sap-feeding arthropods US Patent  US11632953 Publication Date 4/25/2023 
Target
Name:
Inward rectifier potassium channel 2
Synonyms:
Cardiac inward rectifier potassium channel IRK1 KCNJ2 Potassium channel, inwardly rectifying subfamily J member 2 | hIRK1
Type:
PROTEIN
Mol. Mass.:
48281.20
Organism:
Homo sapiens (Human)
Description:
ChEMBL_1515520
Residue:
427
  
Inhibitor
Name:
BDBM600747
Synonyms:
US11632953, Compound 4 | VU0650729
Type:
Small organic molecule
Emp. Form.:
C19H20N2O2
Mol. Mass.:
308.3743
SMILES:
O=C(Cn1ccc2c1CCCC2=O)N1CCCc2ccccc12
: