Target
Cholinesterase
Ligand
BDBM9055
Substrate
BDBM8978
Meas. Tech.
Enzyme Inhibition Assay
IC50
194±n/a nM
Citation
 Hu, MKWu, LJHsiao, GYen, MH Homodimeric tacrine congeners as acetylcholinesterase inhibitors. J Med Chem 45:2277-82 (2002)  
Target
Name:
Cholinesterase
Synonyms:
Acylcholine acylhydrolase Butyrylcholine esterase (BChE) Butyrylcholinesterase (BuChE) CHLE_HUMAN Cholinesterases Pseudocholinesterase
Type:
Homotetramer
Mol. Mass.:
68422.27
Organism:
Homo sapiens (Human)
Description:
P06276
Residue:
602
  
Inhibitor
Name:
BDBM9055
Synonyms:
6-chloro-N-{8-[(6-chloro-1,2,3,4-tetrahydroacridin-9-yl)amino]octyl}-1,2,3,4-tetrahydroacridin-9-amine Octylene-Linked Bis-(6-chloro)tacrine
Type:
Small organic molecule
Emp. Form.:
C34H40Cl2N4
Mol. Mass.:
575.614
SMILES:
Clc1ccc2c(NCCCCCCCCNc3c4CCCCc4nc4cc(Cl)ccc34)c3CCCCc3nc2c1
:
Substrate
Name:
BDBM8978
Synonyms:
(Propylcarbonylthioethyl)trimethylammonium iodide CHEMBL148530 butyrylthiocholine | butyrylthiocholine chloride
Type:
Small organic molecule
Emp. Form.:
C9H20NOS
Mol. Mass.:
190.326
SMILES:
CCCC(=O)SCC[N+](C)(C)C
: