Target
Bromodomain testis-specific protein
Ligand
BDBM50557394
Substrate
Meas. Tech.
Alpha Screen Assay
IC50
22.5±n/a nM
Citation
 Schönbrunn, ELawrence, NJLawrence, HR BRD4-kinase inhibitors as cancer therapeutics US Patent  US11643396 Publication Date 5/9/2023 
Target
Name:
Bromodomain testis-specific protein
Synonyms:
BRDT Bromodomain and extra-terminal motif (BET) Cancer/testis antigen 9 | RING3-like protein
Type:
PROTEIN
Mol. Mass.:
107982.01
Organism:
Homo sapiens (Human)
Description:
ChEMBL_1502985
Residue:
947
  
Inhibitor
Name:
BDBM50557394
Synonyms:
CHEMBL4760892 | US11643396, Example SG3-179
Type:
Small organic molecule
Emp. Form.:
C28H35ClFN7O3S
Mol. Mass.:
604.139
SMILES:
CN1CCC(CC1)NC(=O)c1ccc(Nc2ncc(C)c(Nc3ccc(Cl)c(NS(=O)(=O)C(C)(C)C)c3)n2)cc1F
: