Target
Cyclin-dependent kinase 5 activator 1 [99-307]
Ligand
BDBM601933
Substrate
Meas. Tech.
CDK Inhibition In Vitro Assay
IC50
0.800±n/a nM
Citation
 Strum, JC Substituted 1′,2′-dihydro-3′H-spiro[cyclohexane-1,4′-pyrimido[5′,4′:4,5]pyrrolo[2,1-c][1,2,4]triazin]-3′-ones as cyclin-dependent kinase inhibitors US Patent  US11643416 Publication Date 5/9/2023 
Target
Name:
Cyclin-dependent kinase 5 activator 1 [99-307]
Synonyms:
CDK5/p25 | Cyclin-Dependent Kinase 5 (CDK5)
Type:
Protein Complex
Mol. Mass.:
Description:
Components:
This complex has 2 components.
Component 1
Name:
Cyclin-dependent kinase 5
Synonyms:
CDK5 CDKN5 Cyclin-dependent kinase 5 (CDK5/ p25) Cyclin-dependent-like kinase 5 PSSALRE Tau protein kinase II catalytic subunit
Type:
Enzyme Subunit
Mol. Mass.:
33308.61
Organism:
Homo sapiens (Human)
Description:
Residue:
292
  
Component 2
Name:
Cyclin-dependent kinase 5 activator 1 [99-307]
Synonyms:
CD5R1_HUMAN CDK5R1 Cyclin-dependent kinase 5 activator 1, p25 TPKII regulatory subunit | p25
Type:
Enzyme Subunit
Mol. Mass.:
23250.56
Organism:
Homo sapiens (Human)
Description:
Q15078 aa 99-307
Residue:
209
  
Inhibitor
Name:
BDBM601933
Synonyms:
4-((6'-hydroxy-8'-oxo-7',8'-dihydro-6'H- spiro[cyclohexane-1,9'- pyrazino[1',2':1,5]pyrrolo[2,3-d]pyrimidin]- 2'-yl)amino)benzenesulfonamide | US11643416, Compound 1
Type:
Small organic molecule
Emp. Form.:
C20H22N6O4S
Mol. Mass.:
442.491
SMILES:
NS(=O)(=O)c1ccc(Nc2ncc3cc4C(O)NC(=O)C5(CCCCC5)n4c3n2)cc1
: