Target
Proto-oncogene tyrosine-protein kinase receptor Ret [V804M]
Ligand
BDBM305035
Substrate
Meas. Tech.
RET Enzyme Assay
IC50
443±n/a nM
Citation
 Andrews, SWAronow, SBlake, JFBrandhuber, BJCollier, JCook, AHaas, JJiang, YKolakowski, GRMcfaddin, EAMckenney, MLMcNulty, OTMetcalf, ATMoreno, DARamann, GATang, TPRen, LWalls, SM Substituted pyrazolo[1,5-A]pyridine compounds as RET kinase inhibitors US Patent  US11648243 Publication Date 5/16/2023 
Target
Name:
Proto-oncogene tyrosine-protein kinase receptor Ret [V804M]
Synonyms:
CDHF12 PTC RET RET51 ret enzyme (v804m)
Type:
Enzyme Catalytic Domain
Mol. Mass.:
124350.36
Organism:
Homo sapiens (Human)
Description:
P07949[V804M]
Residue:
1114
  
Inhibitor
Name:
BDBM305035
Synonyms:
US10144734, Example 51 US10441581, Example 51 US11648243, Example 51
Type:
Small organic molecule
Emp. Form.:
C30H34N6O2
Mol. Mass.:
510.63
SMILES:
CC(C)(O)COc1cc(-c2ccc(nc2)N2CCC(C)(CC2)NCc2ccccc2)c2c(cnn2c1)C#N
: