Target
Retinol-binding protein 4
Ligand
BDBM249506
Substrate
Meas. Tech.
SPA Binding Assay
IC50
18.9±n/a nM
Citation
 Petrukhin, KCioffi, CJohnson, GAllikmets, RFreeman, EChen, PConlon, MZhu, L Substituted 4-phenylpiperidines, their preparation and use US Patent  US11649240 Publication Date 5/16/2023 
Target
Name:
Retinol-binding protein 4
Synonyms:
PRBP RBP RET4_HUMAN Retinol-binding protein 4 (RBP4) | spa binding assay for rbp4
Type:
Protein
Mol. Mass.:
23008.75
Organism:
Homo sapiens (Human)
Description:
P02753
Residue:
201
  
Inhibitor
Name:
BDBM249506
Synonyms:
US10072016, Compound 104 US10913746, Compound 104 US9434727, 104 | US9777010, Compound 104
Type:
Small organic molecule
Emp. Form.:
C24H20F5N5O2
Mol. Mass.:
505.4399
SMILES:
Fc1ccc(C2CCN(CC2)C(=O)c2n[nH]c3CN(Cc23)C(=O)c2cccnc2)c(c1F)C(F)(F)F
: