Target
Isocitrate dehydrogenase [NADP] cytoplasmic [R132C]
Ligand
BDBM497334
Substrate
Meas. Tech.
Biochemical Assays for IDH1 and IDH2 Mutant Enzymes
IC50
4.31±0.895 nM
Citation
 Bauer, RABoulet, SLBurkholder, TPHahn, PJRankovic, Z 7-phenylethylamino-4H-pyrimido[4,5-d][1,3]oxazin-2-one compounds as mutant IDH1 and IDH2 inhibitors US Patent  US11649247 Publication Date 5/16/2023 
Target
Name:
Isocitrate dehydrogenase [NADP] cytoplasmic [R132C]
Synonyms:
IDH1 IDH1(R132C) Isocitrate dehydrogenase (IDH1)(R132C) Isocitrate dehydrogenase [NADP] cytoplasmic (IDH1) (R132C) | PICD
Type:
Enzyme Catalytic Domain
Mol. Mass.:
46607.23
Organism:
Homo sapiens (Human)
Description:
O75874[R132C]
Residue:
414
  
Inhibitor
Name:
BDBM497334
Synonyms:
7-[[(1S)-1-[4-[(1R)-2-Cyclopropyl-1-(4-prop-2-enoylpiperazin-1-yl)ethyl]phenyl]ethyl]amino]-1-ethyl-4H-pyrimido[4,5-d][1,3]oxazin-2-one US11629156, Example 1 | US11649247, Example 1
Type:
Small organic molecule
Emp. Form.:
C28H36N6O3
Mol. Mass.:
504.6238
SMILES:
CCN1C(=O)OCc2cnc(N[C@@H](C)c3ccc(cc3)[C@@H](CC3CC3)N3CCN(CC3)C(=O)C=C)nc12
: