Target
Isocitrate dehydrogenase [NADP] cytoplasmic [R132C]
Ligand
BDBM497348
Substrate
Meas. Tech.
Biochemical Assays for IDH1 and IDH2 Mutant Enzymes
IC50
<5.08±n/a nM
Citation
 Bauer, RABoulet, SLBurkholder, TPHahn, PJRankovic, Z 7-phenylethylamino-4H-pyrimido[4,5-d][1,3]oxazin-2-one compounds as mutant IDH1 and IDH2 inhibitors US Patent  US11649247 Publication Date 5/16/2023 
Target
Name:
Isocitrate dehydrogenase [NADP] cytoplasmic [R132C]
Synonyms:
IDH1 IDH1(R132C) Isocitrate dehydrogenase (IDH1)(R132C) Isocitrate dehydrogenase [NADP] cytoplasmic (IDH1) (R132C) | PICD
Type:
Enzyme Catalytic Domain
Mol. Mass.:
46607.23
Organism:
Homo sapiens (Human)
Description:
O75874[R132C]
Residue:
414
  
Inhibitor
Name:
BDBM497348
Synonyms:
1-Ethyl-7-[[(1S)-1-[4-[3- methyl-1-(4-prop-2- enoylpiperazin-1- yl)butyl]phenyl]ethyl]amino]- 4H-pyrimido[4,5- d][1,3]oxazin-2-one US11001596, Example 7 US11629156, Example 6 | US11649247, Example 8
Type:
Small organic molecule
Emp. Form.:
C28H38N6O3
Mol. Mass.:
506.6397
SMILES:
CCN1C(=O)OCc2cnc(N[C@@H](C)c3ccc(cc3)C(CC(C)C)N3CCN(CC3)C(=O)C=C)nc12
: