Target
P2X purinoceptor 7
Ligand
BDBM254319
Substrate
Meas. Tech.
Radioligand Binding assay
Ki
2.50±n/a nM
Citation
 Alcazar Vaca, MJAndres Gil, JIChrovian, CCCoate, HRDe Angelis, MDvorak, CAGelin, CFLetavic, MASavall, BMSoyode-Johnson, AStenne, BMSwanson, DM P2X7 modulators US Patent  US10150765 Publication Date 12/11/2018 
Target
Name:
P2X purinoceptor 7
Synonyms:
ATP receptor P2RX7_HUMAN P2X purinoceptor 7 (P2X7) P2Z receptor | Purinergic receptor
Type:
Protein
Mol. Mass.:
68602.85
Organism:
Homo sapiens (Human)
Description:
Q99572
Residue:
595
  
Inhibitor
Name:
BDBM254319
Synonyms:
US10112937, Example 218 US10703749, Example 218 | US9464084, 218
Type:
Small organic molecule
Emp. Form.:
C17H12Cl2F2N6O
Mol. Mass.:
425.22
SMILES:
C[C@H]1Cc2c(CN1C(=O)c1ccc(Cl)c(F)c1Cl)nnn2-c1ncc(F)cn1
: