Target
Orexin receptor type 2
Ligand
BDBM118681
Substrate
Meas. Tech.
Human Orexin 2 Receptor Radioligand Binding Studies
Ki
277±n/a nM
Citation
 Chai, WLetavic, MALy, KSPippel, DJRudolph, DASappey, KCSavall, BMShah, CRShireman, BTJohnson, ASStocking, EMSwanson, DM Disubstituted octahydropyrrolo[3,4-c]pyrroles as orexin receptor modulators US Patent  US11667644 Publication Date 6/6/2023 
Target
Name:
Orexin receptor type 2
Synonyms:
HCRTR2 OX2R_HUMAN Orexin receptor type 2 (OR-2) Orexin receptor type 2 (OX2R) Ox-2-R | Ox2-R
Type:
Protein
Mol. Mass.:
50710.53
Organism:
Homo sapiens (Human)
Description:
O43614
Residue:
444
  
Inhibitor
Name:
BDBM118681
Synonyms:
US11059828, Example 334 US8653263, 334 USRE48841, Example 334
Type:
Small organic molecule
Emp. Form.:
C22H26N4O3
Mol. Mass.:
394.4668
SMILES:
Cc1cc(C)nc(n1)N1CC2CN(CC2C1)C(=O)c1cccc2OCCCOc12
: