Target
Nuclear factor NF-kappa-B p105 subunit
Ligand
BDBM511480
Substrate
Meas. Tech.
In Vitro Kinase Activity Assay
IC50
28.0±n/a nM
Citation
 deLong, MACarlson, EKopczynski, CSturdivant, JMLichorowic, C Isoquinoline-steroid conjugates and uses thereof US Patent  US11691950 Publication Date 7/4/2023 
Target
Name:
Nuclear factor NF-kappa-B p105 subunit
Synonyms:
NFKB1 Nuclear factor NF-kappa-B (NF-kB) Nuclear factor NF-kappa-B p105 subunit
Type:
Protein
Mol. Mass.:
105329.57
Organism:
Homo sapiens (Human)
Description:
P19838
Residue:
968
  
Inhibitor
Name:
BDBM511480
Synonyms:
US11059789, Example 40 | US11691950, Example 40
Type:
Small organic molecule
Emp. Form.:
C47H51F2N3O10
Mol. Mass.:
855.9187
SMILES:
CC1(C)O[C@@H]2C[C@H]3[C@@H]4C[C@H](F)C5=CC(=O)C=C[C@]5(C)[C@@]4(F)[C@@H](O)C[C@]3(C)[C@@]2(O1)C(=O)COC(=O)CCC(=O)OCc1ccc(cc1)[C@@H](CN)C(=O)Nc1ccc2cnccc2c1
: