Target
Nuclear factor NF-kappa-B p105 subunit
Ligand
BDBM511482
Substrate
Meas. Tech.
In Vitro Kinase Activity Assay
IC50
55.0±n/a nM
Citation
 deLong, MACarlson, EKopczynski, CSturdivant, JMLichorowic, C Isoquinoline-steroid conjugates and uses thereof US Patent  US11691950 Publication Date 7/4/2023 
Target
Name:
Nuclear factor NF-kappa-B p105 subunit
Synonyms:
NFKB1 Nuclear factor NF-kappa-B (NF-kB) Nuclear factor NF-kappa-B p105 subunit
Type:
Protein
Mol. Mass.:
105329.57
Organism:
Homo sapiens (Human)
Description:
P19838
Residue:
968
  
Inhibitor
Name:
BDBM511482
Synonyms:
US11059789, Example 83 | US11691950, Example 83
Type:
Small organic molecule
Emp. Form.:
C45H51FN4O9
Mol. Mass.:
810.9062
SMILES:
C[C@@H]1C[C@H]2[C@@H]3CCC4=CC(=O)C=C[C@]4(C)[C@@]3(F)[C@@H](O)C[C@]2(C)[C@@]1(O)C(=O)COC(=O)C[C@H](N)C(=O)OCc1ccc(cc1)[C@@H](CN)C(=O)Nc1ccc2cnccc2c1
: