Target
Programmed cell death 1 ligand 1
Ligand
BDBM482310
Substrate
Meas. Tech.
Enzyme-Linked Immunosorbent Assay ELISA
IC50
<5±n/a nM
Citation
 Lange, CMalathong, VMali, VRMcMahon, JMcMurtrie, DJPunna, SRoth, HSSingh, RWang, YYang, JZhang, P Immunomodulator compounds US Patent  US11708326 Publication Date 7/25/2023 
Target
Name:
Programmed cell death 1 ligand 1
Synonyms:
B7 homolog 1 B7H1 CD274 PD-L1 PDCD1 ligand 1 PDCD1LG1 Programmed cell death 1 ligand 1 | Programmed death ligand 1
Type:
PROTEIN
Mol. Mass.:
33278.49
Organism:
Homo sapiens (Human)
Description:
ChEMBL_109807
Residue:
290
  
Inhibitor
Name:
BDBM482310
Synonyms:
US10919852, Compound TABLE 1.9 | US11708326, Compound TABLE 1.9
Type:
Small organic molecule
Emp. Form.:
C35H43ClN2O7
Mol. Mass.:
639.178
SMILES:
CCOc1cc(O[C@H]2CCc3c2cccc3-c2cccc(OCCCN3CC[C@@H](O)C3)c2C)c(Cl)cc1CN[C@@H](CO)C(O)=O
: