Target
Programmed cell death 1 ligand 1
Ligand
BDBM609817
Substrate
Meas. Tech.
Enzyme-Linked Immunosorbent Assay ELISA
IC50
<5±n/a nM
Citation
 Lange, CMalathong, VMali, VRMcMahon, JMcMurtrie, DJPunna, SRoth, HSSingh, RWang, YYang, JZhang, P Immunomodulator compounds US Patent  US11708326 Publication Date 7/25/2023 
Target
Name:
Programmed cell death 1 ligand 1
Synonyms:
B7 homolog 1 B7H1 CD274 PD-L1 PDCD1 ligand 1 PDCD1LG1 Programmed cell death 1 ligand 1 | Programmed death ligand 1
Type:
PROTEIN
Mol. Mass.:
33278.49
Organism:
Homo sapiens (Human)
Description:
ChEMBL_109807
Residue:
290
  
Inhibitor
Name:
BDBM609817
Synonyms:
US11708326, Compound TABLE 1.24
Type:
Small organic molecule
Emp. Form.:
C42H47ClN4O7
Mol. Mass.:
755.298
SMILES:
Cc1c(OCCCN2CCC(O)CC2)cccc1-c1cccc2[C@H](CCc12)Oc1cc(OCc2cncc(c2)C#N)c(CN[C@@](C)(CO)C(O)=O)cc1Cl
: