Target
Hemagglutinin
Ligand
BDBM611021
Substrate
Meas. Tech.
Biological Activity
IC50
0.200±n/a nM
Citation
 Jonckers, THMcGowan, DCGuilllemont, JCooymans, LPEmbrechts, WCBuyck, CFBalemans, WMRaboisson, PJ Heterocyclic indoles for use in influenza virus infection US Patent  US10626108 Publication Date 4/21/2020 
Target
Name:
Hemagglutinin
Synonyms:
Type:
Protein
Mol. Mass.:
38441.02
Organism:
Description:
P12590
Residue:
344
 
Inhibitor
Name:
BDBM611021
Synonyms:
US10626108, Compound 15
Type:
Small organic molecule
Emp. Form.:
C22H20F3N8O
Mol. Mass.:
469.4424
SMILES:
Cc1nc(nc(N[C@H]2CCC[C@H](C2)NC(=O)c2cnnn2)c1F)-c1c[nH]c2c(F)cc(F)cc12
: