Target
Hemagglutinin
Ligand
BDBM611026
Substrate
Meas. Tech.
Biological Activity
IC50
26.0±n/a nM
Citation
 Jonckers, THMcGowan, DCGuilllemont, JCooymans, LPEmbrechts, WCBuyck, CFBalemans, WMRaboisson, PJ Heterocyclic indoles for use in influenza virus infection US Patent  US10626108 Publication Date 4/21/2020 
Target
Name:
Hemagglutinin
Synonyms:
Type:
Protein
Mol. Mass.:
38441.02
Organism:
Description:
P12590
Residue:
344
 
Inhibitor
Name:
BDBM611026
Synonyms:
US10626108, Compound 25
Type:
Small organic molecule
Emp. Form.:
C23H26F2N6O
Mol. Mass.:
440.4889
SMILES:
Fc1cc(F)c2[nH]cc(-c3cncc(N[C@@H]4CCC[C@@H](C4)NC(=O)N4CCCC4)n3)c2c1
: