Target
Voltage-dependent N-type calcium channel subunit alpha-1B
Ligand
BDBM611571
Substrate
Meas. Tech.
Calcium Channels Interaction
IC50
<30±n/a nM
Citation
 Villain-Guillot, PGualtieri, MRacine, E Peptide derivatives and uses thereof US Patent  US10626144 Publication Date 4/21/2020 
Target
Name:
Voltage-dependent N-type calcium channel subunit alpha-1B
Synonyms:
BIII CAC1B_HUMAN CACNA1B Calcium channel (Type N) Voltage-dependent N-type calcium channel subunit alpha-1B Voltage-gated N-type calcium channel alpha-1B subunit Voltage-gated calcium channel Voltage-gated calcium channel subunit alpha Cav2.2 ((alpha 1B, beta 1b, alpha 2 delta-1) | calcium channel, voltage-dependent, N type, alpha 1B subunit
Type:
Enzyme
Mol. Mass.:
262548.16
Organism:
Homo sapiens (Human)
Description:
Q00975
Residue:
2339
  
Inhibitor
Name:
BDBM611571
Synonyms:
US10626144, Compound 28.1
Type:
Small organic molecule
Emp. Form.:
C54H100N22O11
Mol. Mass.:
1233.5126
SMILES:
CC[C@H](NC(=O)[C@@H](NC(=O)[C@@H](N)CCCCN)[C@@H](O)CN)C(=O)NCC(=O)N[C@H](CCCN)C(=O)N1CCC[C@H]1C(=O)N[C@@H](Cc1cnc[nH]1)C(=O)N[C@@H](CCCCN)C(=O)N\C(=C/CCNC(N)=N)C(=O)N[C@@H](CCCCN)C(=O)NCCCCN
: