Target
GTPase KRas [G12D]
Ligand
BDBM573424
Substrate
Meas. Tech.
Inhibition of KRas G12D-mediated Phosphorylation of ERK
IC50
0.500±n/a nM
Target
Name:
GTPase KRas [G12D]
Synonyms:
GTPase KRas (G12D) KRAS2 RASK_HUMAN
Type:
Enzyme Catalytic Domain
Mol. Mass.:
21713.12
Organism:
Homo sapiens (Human)
Description:
P01116[G12D]
Residue:
189
  
Inhibitor
Name:
BDBM573424
Synonyms:
US11453683, Example 282 US20230279025, Example 366
Type:
Small organic molecule
Emp. Form.:
C31H31F3N6O2
Mol. Mass.:
576.612
SMILES:
Oc1cc(-c2ncc3c(nc(OC[C@@]45CCCN4C[C@H](F)C5)nc3c2F)N2CC3CCC(C2)N3)c2c(F)cccc2c1
: