Target
GTPase KRas [G12D]
Ligand
BDBM50579595
Substrate
Meas. Tech.
Inhibition of KRas G12D-mediated Phosphorylation of ERK
IC50
0.300±n/a nM
Target
Name:
GTPase KRas [G12D]
Synonyms:
GTPase KRas (G12D) KRAS2 RASK_HUMAN
Type:
Enzyme Catalytic Domain
Mol. Mass.:
21713.12
Organism:
Homo sapiens (Human)
Description:
P01116[G12D]
Residue:
189
  
Inhibitor
Name:
BDBM50579595
Synonyms:
CHEMBL4863339 US20230279025, Example 185
Type:
Small organic molecule
Emp. Form.:
C33H33FN6O2
Mol. Mass.:
564.6525
SMILES:
Oc1cc(-c2ncc3c(nc(OCC45CCCN4CCC5)nc3c2F)N2CC3CCC(C2)N3)c2c(cccc2c1)C#C
: