Target
GTPase KRas [G12D]
Ligand
BDBM617339
Substrate
Meas. Tech.
Inhibition of KRas G12D-mediated Phosphorylation of ERK
IC50
0.027±n/a nM
Target
Name:
GTPase KRas [G12D]
Synonyms:
GTPase KRas (G12D) KRAS2 RASK_HUMAN
Type:
Enzyme Catalytic Domain
Mol. Mass.:
21713.12
Organism:
Homo sapiens (Human)
Description:
P01116[G12D]
Residue:
189
  
Inhibitor
Name:
BDBM617339
Synonyms:
US20230279025, Example 460
Type:
Small organic molecule
Emp. Form.:
C31H32F2N6O
Mol. Mass.:
542.6222
SMILES:
Fc1ccc2cccc(-c3ncc4c(nc(OCC56CCCN5CCC6)nc4c3F)N3CC4CCC(C3)N4)c2c1
: