Target
GTPase KRas [G12D]
Ligand
BDBM617323
Substrate
Meas. Tech.
Inhibition of KRas G12D-mediated Phosphorylation of ERK
IC50
<0.002±n/a nM
Target
Name:
GTPase KRas [G12D]
Synonyms:
GTPase KRas (G12D) KRAS2 RASK_HUMAN
Type:
Enzyme Catalytic Domain
Mol. Mass.:
21713.12
Organism:
Homo sapiens (Human)
Description:
P01116[G12D]
Residue:
189
  
Inhibitor
Name:
BDBM617323
Synonyms:
US20230279025, Example 452 | US20230279025, Example 467
Type:
Small organic molecule
Emp. Form.:
C31H35ClF2N6O2
Mol. Mass.:
597.098
SMILES:
C[C@@H]1CC1c1c(Cl)cc(O)cc1-c1ncc2c(nc(OC[C@@]34CCCN3C[C@H](F)C4)nc2c1F)N1CC2CCC(C1)N2
: