Target
Dimer of Gag-Pol polyprotein [501-599,Q508K,L534I,L564I,C568A,C596A]
Ligand
BDBM9264
Substrate
HIV Protease substrate
Meas. Tech.
Protease Inhibition Assay
pH
6.4±n/a
Temperature
298.15±n/a K
Ki
0.7±0.1 nM
Citation
 Ghosh, AKSwanson, LMCho, HLeshchenko, SHussain, KAKay, SWalters, DEKoh, YMitsuya, H Structure-based design: synthesis and biological evaluation of a series of novel cycloamide-derived HIV-1 protease inhibitors. J Med Chem 48:3576-85 (2005)  
Target
Name:
Dimer of Gag-Pol polyprotein [501-599,Q508K,L534I,L564I,C568A,C596A]
Synonyms:
HIV-1 Protease
Type:
Protein Complex
Mol. Mass.:
Description:
Components:
This complex has 2 components.
Component 1
Name:
Gag-Pol polyprotein [501-599,Q508K,L534I,L564I,C568A,C596A]
Synonyms:
HIV-1 Protease chain A gag-pol
Type:
Enzyme Subunit
Mol. Mass.:
10732.11
Organism:
Human immunodeficiency virus type 1
Description:
The HIV-1 protease (Genbank HIVHXB2CG) clone was constructed with the substitutions Q7K, L33I, and L63I, to minimize the autoproteolysis of the protease, and C67A and C95A, to prevent cysteine-thiol oxidation.
Residue:
99
  
Component 2
Name:
Gag-Pol polyprotein [501-599,Q508K,L534I,L564I,C568A,C596A]
Synonyms:
HIV-1 Protease chain A gag-pol
Type:
Enzyme Subunit
Mol. Mass.:
10732.11
Organism:
Human immunodeficiency virus type 1
Description:
The HIV-1 protease (Genbank HIVHXB2CG) clone was constructed with the substitutions Q7K, L33I, and L63I, to minimize the autoproteolysis of the protease, and C67A and C95A, to prevent cysteine-thiol oxidation.
Residue:
99
  
Inhibitor
Name:
BDBM9264
Synonyms:
(2R)-2-hydroxy-2-[(10S)-16-hydroxy-12-oxo-3,4,5,6,7,8,9,10,11,12-decahydro-2H-1,11-benzoxazacyclotetradecin-10-yl]-N-(4-methoxyphenyl)-N-(2-methylpropyl)ethane-1-sulfonamido N-{(2R)-2-hydroxy-2-[(10S)-16-hydroxy-12-oxo-3,4,5,6,7,8,9,10,11,12-decahydro-2H-1,11-benzoxazacyclotetradecin-10-yl]ethyl}-N-isobutyl-4-methoxybenzenesulfonamide
Type:
Small organic molecule
Emp. Form.:
C29H42N2O7S
Mol. Mass.:
562.718
SMILES:
COc1ccc(cc1)S(=O)(=O)N(CC(C)C)C[C@@H](O)[C@@H]1CCCCCCCCOc2c(O)cccc2C(=O)N1
:
Substrate
Name:
HIV Protease substrate
Synonyms:
Fluorogenic Peptide Substrate
Type:
Peptide
Mol. Mass.:
3467.28
Organism:
Description:
Residue:
30