Target
Neprilysin/Angiotensin-converting enzyme
Ligand
BDBM298292
Substrate
Meas. Tech.
Enzyme Inhibition Assays (Assay 1)
Ki
<1.000±n/a nM
Citation
 Hughes, ADFenster, EFleury, MGendron, RMoran, EJ NEPRILYSIN INHIBITORS US Patent  US20230285340 Publication Date 9/14/2023 
Target
Name:
Neprilysin/Angiotensin-converting enzyme
Synonyms:
Type:
Protein
Mol. Mass.:
Description:
Components:
This complex has 2 components.
Component 1
Name:
Neprilysin
Synonyms:
Atriopeptidase CD_antigen=CD10 EPN MME NEP_HUMAN Neutral endopeptidase | Neutral endopeptidase 24.11
Type:
Enzyme
Mol. Mass.:
85505.38
Organism:
Homo sapiens (Human)
Description:
P08473
Residue:
750
  
Component 2
Name:
Angiotensin-converting enzyme
Synonyms:
ACE Angiotensin converting enzyme (ACE) Angiotensin-converting enzyme, soluble form CD_antigen=CD143 DCP1 Kininase II
Type:
Enzyme
Mol. Mass.:
149709.01
Organism:
Homo sapiens (Human)
Description:
Residue:
1306
  
Inhibitor
Name:
BDBM298292
Synonyms:
US10123984, Example 2T US11547687, Example 2T | US20230285340, Example 2T
Type:
Small organic molecule
Emp. Form.:
C22H24ClNO7
Mol. Mass.:
449.881
SMILES:
COCCOC(=O)C(=O)N[C@@H](C[C@@H](O)C(O)=O)Cc1ccc(cc1)-c1cccc(Cl)c1
: