Target
Replicase polyprotein 1ab
Ligand
BDBM50367057
Substrate
Meas. Tech.
Chan-Lam
IC50
2500±n/a nM
Citation
Some error occurs, please report
Target
Name:
Replicase polyprotein 1ab
Synonyms:
ORF1ab polyprotein pp1ab | rep
Type:
Protein
Mol. Mass.:
794070.71
Organism:
2019-nCoV
Description:
P0DTD1
Residue:
7096
  
Inhibitor
Name:
BDBM50367057
Synonyms:
CHEMBL1235200 | EN300-73161
Type:
Small organic molecule
Emp. Form.:
C9H13NO
Mol. Mass.:
151.2056
SMILES:
N[C@@H](CO)Cc1ccccc1
: