Target
Tyrosine-protein kinase ABL1
Ligand
BDBM13216
Substrate
Meas. Tech.
Inhibition of SIK; Abl and Src Kinases by Other Kinase Inhibitor
IC50
1.50±n/a nM
Citation
 SENNHENN, PBISSINGER, SLOFERER, HBANCROFT, DMICHELS, TKHANDELWAL, N HALOGENATED-HETEROARYL AND OTHER HETEROCYCLIC KINASE INHIBITORS, AND USES THEREOF US Patent  US20230348453 Publication Date 11/2/2023 
Target
Name:
Tyrosine-protein kinase ABL1
Synonyms:
ABL ABL1_HUMAN JTK7 Proto-oncogene tyrosine-protein kinase ABL1 Tyrosine-protein kinase ABL V-abl Abelson murine leukemia viral oncogene homolog 1 p150 | tyrosine-protein kinase ABL1 isoform a
Type:
Enzyme
Mol. Mass.:
122897.30
Organism:
Homo sapiens (Human)
Description:
P00519
Residue:
1130
  
Inhibitor
Name:
BDBM13216
Synonyms:
BMS-354825 DASATINIB N-(2-chloro-6-methylphenyl)-2-({6-[4-(2-hydroxyethyl)piperazin-1-yl]-2-methylpyrimidin-4-yl}amino)-1,3-thiazole-5-carboxamide US20230348453, Compound A8 med.21724, Compound Dasatinib
Type:
Small organic molecule
Emp. Form.:
C22H26ClN7O2S
Mol. Mass.:
488.006
SMILES:
Cc1nc(Nc2ncc(s2)C(=O)Nc2c(C)cccc2Cl)cc(n1)N1CCN(CCO)CC1
: