Target
Proto-oncogene tyrosine-protein kinase Src
Ligand
BDBM632956
Substrate
Meas. Tech.
Inhibition of SIK; Abl and Src Kinases by Other Kinase Inhibitor
IC50
<1.50±n/a nM
Citation
 SENNHENN, PBISSINGER, SLOFERER, HBANCROFT, DMICHELS, TKHANDELWAL, N HALOGENATED-HETEROARYL AND OTHER HETEROCYCLIC KINASE INHIBITORS, AND USES THEREOF US Patent  US20230348453 Publication Date 11/2/2023 
Target
Name:
Proto-oncogene tyrosine-protein kinase Src
Synonyms:
Calmodulin/Proto-oncogene tyrosine-protein kinase Src Proto-oncogene c-Src SRC SRC_HUMAN V-src sarcoma (Schmidt-Ruppin A-2) viral oncogene homolog (avian) p60-Src | pp60c-src
Type:
Protein
Mol. Mass.:
59838.60
Organism:
Homo sapiens (Human)
Description:
P12931
Residue:
536
  
Inhibitor
Name:
BDBM632956
Synonyms:
US20230348453, Compound C4
Type:
Small organic molecule
Emp. Form.:
C21H25ClN8O2S
Mol. Mass.:
488.994
SMILES:
Cc1nc(Nc2ncc(s2)C(=O)Nc2c(C)cncc2Cl)cc(n1)N1CCN(CCO)CC1
: