Target
Serine/threonine-protein kinase SIK1
Ligand
BDBM632956
Substrate
Meas. Tech.
Inhibition of SIK; Abl and Src Kinases by Other Kinase Inhibitor
IC50
32.7±n/a nM
Citation
 SENNHENN, PBISSINGER, SLOFERER, HBANCROFT, DMICHELS, TKHANDELWAL, N HALOGENATED-HETEROARYL AND OTHER HETEROCYCLIC KINASE INHIBITORS, AND USES THEREOF US Patent  US20230348453 Publication Date 11/2/2023 
Target
Name:
Serine/threonine-protein kinase SIK1
Synonyms:
SIK SIK1_HUMAN | SNF1LK
Type:
PROTEIN
Mol. Mass.:
84908.20
Organism:
Homo sapiens (Human)
Description:
ChEMBL_774213
Residue:
783
  
Inhibitor
Name:
BDBM632956
Synonyms:
US20230348453, Compound C4
Type:
Small organic molecule
Emp. Form.:
C21H25ClN8O2S
Mol. Mass.:
488.994
SMILES:
Cc1nc(Nc2ncc(s2)C(=O)Nc2c(C)cncc2Cl)cc(n1)N1CCN(CCO)CC1
: