Target
Serine/threonine-protein kinase SIK3
Ligand
BDBM632956
Substrate
Meas. Tech.
Inhibition of SIK; Abl and Src Kinases by Other Kinase Inhibitor
IC50
677±n/a nM
Citation
 SENNHENN, PBISSINGER, SLOFERER, HBANCROFT, DMICHELS, TKHANDELWAL, N HALOGENATED-HETEROARYL AND OTHER HETEROCYCLIC KINASE INHIBITORS, AND USES THEREOF US Patent  US20230348453 Publication Date 11/2/2023 
Target
Name:
Serine/threonine-protein kinase SIK3
Synonyms:
2.7.11.1 QSK SIK-3 SIK3_HUMAN Serine/threonine-protein kinase QSK Synonyms=KIAA0999
Type:
PROTEIN
Mol. Mass.:
144859.31
Organism:
Homo sapiens
Description:
ChEMBL_102770
Residue:
1321
  
Inhibitor
Name:
BDBM632956
Synonyms:
US20230348453, Compound C4
Type:
Small organic molecule
Emp. Form.:
C21H25ClN8O2S
Mol. Mass.:
488.994
SMILES:
Cc1nc(Nc2ncc(s2)C(=O)Nc2c(C)cncc2Cl)cc(n1)N1CCN(CCO)CC1
: