Target
Serine/threonine-protein kinase SIK3
Ligand
BDBM13216
Substrate
Meas. Tech.
Inhibition of SIK; Abl and Src Kinases by Other Kinase Inhibitor
IC50
35.0±n/a nM
Citation
 SENNHENN, PBISSINGER, SLOFERER, HBANCROFT, DMICHELS, TKHANDELWAL, N HALOGENATED-HETEROARYL AND OTHER HETEROCYCLIC KINASE INHIBITORS, AND USES THEREOF US Patent  US20230348453 Publication Date 11/2/2023 
Target
Name:
Serine/threonine-protein kinase SIK3
Synonyms:
2.7.11.1 QSK SIK-3 SIK3_HUMAN Serine/threonine-protein kinase QSK Synonyms=KIAA0999
Type:
PROTEIN
Mol. Mass.:
144859.31
Organism:
Homo sapiens
Description:
ChEMBL_102770
Residue:
1321
  
Inhibitor
Name:
BDBM13216
Synonyms:
BMS-354825 DASATINIB N-(2-chloro-6-methylphenyl)-2-({6-[4-(2-hydroxyethyl)piperazin-1-yl]-2-methylpyrimidin-4-yl}amino)-1,3-thiazole-5-carboxamide US20230348453, Compound A8 med.21724, Compound Dasatinib
Type:
Small organic molecule
Emp. Form.:
C22H26ClN7O2S
Mol. Mass.:
488.006
SMILES:
Cc1nc(Nc2ncc(s2)C(=O)Nc2c(C)cccc2Cl)cc(n1)N1CCN(CCO)CC1
: