Target
Collagenase ColH
Ligand
BDBM633989
Substrate
Meas. Tech.
Inhibition of Gelatinase E Assay
IC50
>100000±n/a nM
Citation
 HOEKSTRA, WRYU, HCHINTHA, P SMALL MOLECULE INHIBITORS OF BACTERIAL TOXINS US Patent  US20230357139 Publication Date 11/9/2023 
Target
Name:
Collagenase ColH
Synonyms:
3.4.24.3 Class II collagenase Gelatinase ColH colH
Type:
PROTEIN
Mol. Mass.:
116370.49
Organism:
Hathewaya histolytica
Description:
ChEMBL_119962
Residue:
1021
  
Inhibitor
Name:
BDBM633989
Synonyms:
US20230357139, Compound G
Type:
Small organic molecule
Emp. Form.:
C15H24N2O6S
Mol. Mass.:
360.426
SMILES:
COCCOc1ccc(cc1)S(=O)(=O)N(CC(C)C)CC(=O)NO
: