Target
Vascular endothelial growth factor receptor 1
Ligand
BDBM21
Substrate
poly-Glu-Ala-Tyr
Meas. Tech.
Homogeneous Time-resolved Fluorescence (HTRF) Assay
IC50
100±n/a nM
Citation
 Kiselyov, ASPiatnitski, ESemenova, MSemenov, VV N-(Aryl)-4-(azolylethyl)thiazole-5-carboxamides: novel potent inhibitors of VEGF receptors I and II. Bioorg Med Chem Lett 16:602-6 (2006)  
Target
Name:
Vascular endothelial growth factor receptor 1
Synonyms:
FLT FRT Fms-like tyrosine kinase 1 Tyrosine-protein kinase FRT VEGFR-1 VGFR1_HUMAN Vascular endothelial growth factor receptor 1 (FLT1) Vascular endothelial growth factor receptor 1 and 2 (Flt-1 and KDR) Vascular permeability factor receptor vascular endothelial growth factor/vascular permeability factor receptor
Type:
Receptor Tyrosine Kinase
Mol. Mass.:
150800.23
Organism:
Homo sapiens (Human)
Description:
P17948
Residue:
1338
  
Inhibitor
Name:
BDBM21
Synonyms:
CHEMBL24828 VANDETANIB ZD6474 | cid_3081361
Type:
Emp. Form.:
C22H24BrFN4O2
Mol. Mass.:
475.354
SMILES:
COc1cc2c(Nc3ccc(Br)cc3F)ncnc2cc1OCC1CCN(C)CC1
:
Substrate
Name:
poly-Glu-Ala-Tyr
Synonyms:
poly-Glu-Ala-Tyr-biotin
Type:
Random Copolymer
Mol. Mass.:
358.43
Organism:
Description:
It is a synthetic polymer of glutamic acid, alanine and tyrosine (poly-Glu-Ala-Tyr) that has been biotinylated.
Residue:
3
NA