Target
Fatty acid-binding protein 5
Ligand
BDBM635733
Substrate
Meas. Tech.
FABP3, FABP5, and FABP7 Binding Assay
Ki
320±80 nM
Citation
 Ojima, IKaczocha, MAwwa, MPepe, A TRUXILLIC ACID MONOESTER-DERIVATIVES AS SELECTIVE FABP5 INHIBITORS AND PHARMACEUTICAL COMPOSITIONS AND USES THEREOF US Patent  US20230365488 Publication Date 11/16/2023 
Target
Name:
Fatty acid-binding protein 5
Synonyms:
FABP5 Fatty acid binding protein epidermal | Fatty acid-binding protein 5 (FABP5)
Type:
Enzyme
Mol. Mass.:
15164.79
Organism:
Homo sapiens (Human)
Description:
Q01469
Residue:
135
  
Inhibitor
Name:
BDBM635733
Synonyms:
US20230365488, Compound 1a
Type:
Small organic molecule
Emp. Form.:
C31H23NO4
Mol. Mass.:
473.5186
SMILES:
OC(=O)[C@@H]1C([C@H]([C@@H]1c1ccccc1)C(=O)Oc1cc(ccc1C#N)-c1ccccc1)c1ccccc1
: