Target
Fatty acid-binding protein 5
Ligand
BDBM635749
Substrate
Meas. Tech.
FABP3, FABP5, and FABP7 Binding Assay
Ki
120±20 nM
Citation
 Ojima, IKaczocha, MAwwa, MPepe, A TRUXILLIC ACID MONOESTER-DERIVATIVES AS SELECTIVE FABP5 INHIBITORS AND PHARMACEUTICAL COMPOSITIONS AND USES THEREOF US Patent  US20230365488 Publication Date 11/16/2023 
Target
Name:
Fatty acid-binding protein 5
Synonyms:
FABP5 Fatty acid binding protein epidermal | Fatty acid-binding protein 5 (FABP5)
Type:
Enzyme
Mol. Mass.:
15164.79
Organism:
Homo sapiens (Human)
Description:
Q01469
Residue:
135
  
Inhibitor
Name:
BDBM635749
Synonyms:
US20230365488, Compound 1f
Type:
Small organic molecule
Emp. Form.:
C32H25NO5
Mol. Mass.:
503.5446
SMILES:
OC(=O)[C@@H]1C([C@H]([C@@H]1c1ccccc1)C(=O)Oc1cccc(c1)-c1ccc2CC(=O)Nc2c1)c1ccccc1
: