Target
Fatty acid-binding protein 5
Ligand
BDBM635750
Substrate
Meas. Tech.
FABP3, FABP5, and FABP7 Binding Assay
Ki
410±150 nM
Citation
 Ojima, IKaczocha, MAwwa, MPepe, A TRUXILLIC ACID MONOESTER-DERIVATIVES AS SELECTIVE FABP5 INHIBITORS AND PHARMACEUTICAL COMPOSITIONS AND USES THEREOF US Patent  US20230365488 Publication Date 11/16/2023 
Target
Name:
Fatty acid-binding protein 5
Synonyms:
FABP5 Fatty acid binding protein epidermal | Fatty acid-binding protein 5 (FABP5)
Type:
Enzyme
Mol. Mass.:
15164.79
Organism:
Homo sapiens (Human)
Description:
Q01469
Residue:
135
  
Inhibitor
Name:
BDBM635750
Synonyms:
US20230365488, Compound 1g
Type:
Small organic molecule
Emp. Form.:
C34H30O8
Mol. Mass.:
566.5972
SMILES:
COc1ccccc1C1[C@H]([C@H]([C@@H]1C(=O)Oc1cccc(c1)-c1cccc2OCCOc12)c1ccccc1OC)C(O)=O
: