Target
Serine/threonine-protein kinase PLK4
Ligand
BDBM635951
Substrate
Meas. Tech.
PLK4 Biochemical Assay
IC50
0.434±n/a nM
Citation
 NDUBAKU, CMOORE, JTGIBBONS, PACHANG, JHROMERO, FADU, XKAWAI, HCIBLAT, SWANG, HALBERT, VCONSTANTINEAU-FORGET, LSILVA, HPOLAT, DENAYYAR, ASHORE, DGWU, KTAN, J POLO LIKE KINASE 4 INHIBITORS US Patent  US20230365537 Publication Date 11/16/2023 
Target
Name:
Serine/threonine-protein kinase PLK4
Synonyms:
PLK4 Polo-Like Kinase 4 STK18 | Serine/threonine-protein kinase PLK4
Type:
PROTEIN
Mol. Mass.:
108996.91
Organism:
Homo sapiens (Human)
Description:
ChEMBL_1474078
Residue:
970
  
Inhibitor
Name:
BDBM635951
Synonyms:
(1R,2S)-2-(3-{[5-chloro-2-cyclopropyl-6-(3-hydroxyazetidin-1-yl)pyrimidin-4-yl]amino}-1H-indazol-6 yl)-5'-methoxyspiro[cyclopropane-1,3'-indol]-2'(1'H)-one | US20230365537, Example 76
Type:
Small organic molecule
Emp. Form.:
C28H26ClN7O3
Mol. Mass.:
544.004
SMILES:
COc1ccc2NC(=O)[C@@]3(C[C@H]3c3ccc4c(Nc5nc(nc(N6CC(O)C6)c5Cl)C5CC5)n[nH]c4c3)c2c1
: