Target
Protein delta homolog 1
Ligand
BDBM637108
Substrate
Meas. Tech.
DLK Biochemical Assay
IC50
2.40±n/a nM
Citation
 Patel, AZack, DWelsbie, DBerlinicke, CLilley, BNKim, BSchirok, HSchubert, WKoch, MNicolas, LTerjung, CLobell, MHolton, SJungmann, N SUBSTITUTED 4-([1,2,4]TRIAZOLO[1,5-a]PYRIDIN-6-YL)THIOPHENE-2-CARBOXAMIDE DERIVATIVES AND USE THEREOF US Patent  US20230382904 Publication Date 11/30/2023 
Target
Name:
Protein delta homolog 1
Synonyms:
DLK DLK1 FA1 pG2
Type:
PROTEIN
Mol. Mass.:
41294.81
Organism:
Homo sapiens (Human)
Description:
ChEMBL_1444684
Residue:
383
  
Inhibitor
Name:
BDBM637108
Synonyms:
US20230382904, Compound 28 US20230382904, Compound 48
Type:
Small organic molecule
Emp. Form.:
C24H22FN7O3S
Mol. Mass.:
507.54
SMILES:
C[C@H](NC(=O)c1cc(cs1)-c1cc(C(=O)NC2CNC(=O)C2)c2nc(N)nn2c1)c1ccc(F)cc1
: