Target
Protein delta homolog 1
Ligand
BDBM637169
Substrate
Meas. Tech.
DLK Biochemical Assay
IC50
3.70±n/a nM
Citation
 Patel, AZack, DWelsbie, DBerlinicke, CLilley, BNKim, BSchirok, HSchubert, WKoch, MNicolas, LTerjung, CLobell, MHolton, SJungmann, N SUBSTITUTED 4-([1,2,4]TRIAZOLO[1,5-a]PYRIDIN-6-YL)THIOPHENE-2-CARBOXAMIDE DERIVATIVES AND USE THEREOF US Patent  US20230382904 Publication Date 11/30/2023 
Target
Name:
Protein delta homolog 1
Synonyms:
DLK DLK1 FA1 pG2
Type:
PROTEIN
Mol. Mass.:
41294.81
Organism:
Homo sapiens (Human)
Description:
ChEMBL_1444684
Residue:
383
  
Inhibitor
Name:
BDBM637169
Synonyms:
US20230382904, Compound 89
Type:
Small organic molecule
Emp. Form.:
C25H28N6O2S
Mol. Mass.:
476.594
SMILES:
CC[C@H](C)NC(=O)c1cc(cn2nc(N)nc12)-c1csc(c1)C(=O)N[C@@H](CC)c1ccccc1
: