Target
Protein delta homolog 1
Ligand
BDBM637180
Substrate
Meas. Tech.
DLK Biochemical Assay
IC50
5.80±n/a nM
Citation
 Patel, AZack, DWelsbie, DBerlinicke, CLilley, BNKim, BSchirok, HSchubert, WKoch, MNicolas, LTerjung, CLobell, MHolton, SJungmann, N SUBSTITUTED 4-([1,2,4]TRIAZOLO[1,5-a]PYRIDIN-6-YL)THIOPHENE-2-CARBOXAMIDE DERIVATIVES AND USE THEREOF US Patent  US20230382904 Publication Date 11/30/2023 
Target
Name:
Protein delta homolog 1
Synonyms:
DLK DLK1 FA1 pG2
Type:
PROTEIN
Mol. Mass.:
41294.81
Organism:
Homo sapiens (Human)
Description:
ChEMBL_1444684
Residue:
383
  
Inhibitor
Name:
BDBM637180
Synonyms:
US20230382904, Compound 100
Type:
Small organic molecule
Emp. Form.:
C24H23N7O4S
Mol. Mass.:
505.549
SMILES:
C[C@@H](CO)NC(=O)c1cc(cn2nc(N)nc12)-c1csc(c1)C(=O)N[C@@H](C)c1nc2ccccc2o1
: