Target
S-adenosylmethionine synthase isoform type-2
Ligand
BDBM637564
Substrate
Meas. Tech.
Measurement of Mat2A inhibition is performed in 384 well format absorbance-based assay
IC50
17.0±n/a nM
Citation
 BELL, ASBESNARD, JBRADLEY, ARGREEN, LHAAP, WKOCER, BKUGLSTATTER, ALUCAS, XMATTEI, PMAZUNIN, DRIEMER, CVAN HOORN, WP PYRAZOLEAMIDE DERIVATIVES US Patent  US20230382911 Publication Date 11/30/2023 
Target
Name:
S-adenosylmethionine synthase isoform type-2
Synonyms:
AMS2 MAT 2 MAT2A METK2_HUMAN Methionine adenosyltransferase II
Type:
Protein
Mol. Mass.:
43659.65
Organism:
Human
Description:
P31153
Residue:
395
  
Inhibitor
Name:
BDBM637564
Synonyms:
(3-amino-6-cyclopropyl-1H- pyrazolo[3,4-b]pyridin-1-yl)(2- chloropyridin-3-yl)methanone | US20230382911, Example 76
Type:
Small organic molecule
Emp. Form.:
C15H12ClN5O
Mol. Mass.:
313.742
SMILES:
Nc1nn(C(=O)c2cccnc2Cl)c2nc(ccc12)C1CC1
: