Target
11-beta-hydroxysteroid dehydrogenase type 2
Ligand
BDBM642894
Substrate
Meas. Tech.
HSD2 Activity
IC50
31.6±n/a nM
Citation
 Dragoli, DLuehr, GChen, TLewis, JLeadbetter, M Glycyrrhetinic acid derivatives for use in treating hyperkalemia US Patent  US11858959 Publication Date 1/2/2024 
Target
Name:
11-beta-hydroxysteroid dehydrogenase type 2
Synonyms:
11-DH2 11-beta-Hydroxysteroid Dehydrogenase 2 (11-beta-HSD2) 11-beta-hydroxysteroid dehydrogenase 2 11-beta-hydroxysteroid dehydrogenase type 2 (11-beta-HSD2) DHI2_HUMAN HSD11K SDR9C3
Type:
Enzyme
Mol. Mass.:
44141.72
Organism:
Homo sapiens (Human)
Description:
Purified recombinant human 11beta-HSD2.
Residue:
405
  
Inhibitor
Name:
BDBM642894
Synonyms:
(2S,4aS,6aS,6bR,8aR,9S,10S,12aS,12bR,14bR)-10-Acetoxy-2,4a,6a,6b,9,12a-hexamethyl-9-(((5-methyl-2-oxo-1,3-dioxol-4-yl)methoxy)carbonyl)-13-oxo-1,2,3,4,4a,5,6,6a,6b,7,8,8a,9,10,11,12,12a,12b,13,14b-icosahydropicene-2-carboxylic acid | US11858959, Compound 243-1
Type:
Small organic molecule
Emp. Form.:
C37H50O10
Mol. Mass.:
654.7869
SMILES:
CC(=O)O[C@H]1CC[C@@]2(C)[C@@H](CC[C@]3(C)[C@@H]2C(=O)C=C2[C@@H]4C[C@](C)(CC[C@]4(C)CC[C@@]32C)C(O)=O)[C@]1(C)C(=O)OCc1oc(=O)oc1C
: