Target
Gamma-aminobutyric acid receptor subunit alpha-5/beta-2/gamma-1
Ligand
BDBM643750
Substrate
Meas. Tech.
Binding Assay for γ2-Containing GABAA Subtypes
Ki
0.800±n/a nM
Citation
 CECERE, GGOBBI, LHERNANDEZ, MKNOFLACH, FKOBLET, AO''CONNOR, ECOLIVARES MORALES, AMREUTLINGER, MRUNTZ-SCHMITT, VWAMSTEEKER CUSULIN, JIZORN, N SUBSTITUTED BENZO[f][l ,2,4JTRIAZOL0[4,3-a][l ,4JDIAZEPINES AS GABA A GAMMA! POSITIVE ALLOSTERIC MODULATORS US Patent  US20240002393 Publication Date 1/4/2024 
Target
Name:
Gamma-aminobutyric acid receptor subunit alpha-5/beta-2/gamma-1
Synonyms:
GABAA alpha5Beta2gamma1
Type:
Protein
Mol. Mass.:
Description:
Components:
This complex has 3 components.
Component 1
Name:
Gamma-aminobutyric acid receptor subunit alpha-5
Synonyms:
GABA receptor alpha-5 subunit GABRA5 Gamma-aminobutyric acid receptor subunit alpha-5 (GABA(A)) | Gamma-aminobutyric acid receptor subunit alpha-5 (GABAA)
Type:
Enzyme
Mol. Mass.:
52160.59
Organism:
Homo sapiens (Human)
Description:
P31644
Residue:
462
  
Component 2
Name:
Gamma-aminobutyric acid receptor subunit beta-2
Synonyms:
GABA(A) receptor subunit beta-2 GBRB2_HUMAN
Type:
PROTEIN
Mol. Mass.:
59167.91
Organism:
Homo sapiens (Human)
Description:
EBI_221
Residue:
512
  
Component 3
Name:
Gamma-aminobutyric acid receptor subunit gamma-1
Synonyms:
GABA(A) receptor subunit gamma-1
Type:
Protein
Mol. Mass.:
53602.97
Organism:
Human
Description:
Q8N1C3
Residue:
465
  
Inhibitor
Name:
BDBM643750
Synonyms:
(4S)-7-chloro-6-(2,6-difluorophenyl)-8-iodo-1,4-dimethyl-4H-[1,2,4]triazolo[4,3-a][1,4]benzodiazepine | US20240002393, Example 102
Type:
Small organic molecule
Emp. Form.:
C18H12ClF2IN4
Mol. Mass.:
484.669
SMILES:
C[C@@H]1N=C(c2c(F)cccc2F)c2c(Cl)c(I)ccc2-n2c(C)nnc12
: