Target
Fatty acid-binding protein 5
Ligand
BDBM312313
Substrate
Meas. Tech.
Time Resolved-Fluorescence Energy Transfer (TR-FRET) Assay
IC50
20.0±n/a nM
Citation
 Buettelmann, BCeccarelli, SMKuehne, HKuhn, BNeidhart, WObst Sander, URichter, H Bicyclic thiophenylamide compounds US Patent  US9604977 Publication Date 3/28/2017 
Target
Name:
Fatty acid-binding protein 5
Synonyms:
FABP5 Fatty acid binding protein epidermal | Fatty acid-binding protein 5 (FABP5)
Type:
Enzyme
Mol. Mass.:
15164.79
Organism:
Homo sapiens (Human)
Description:
Q01469
Residue:
135
  
Inhibitor
Name:
BDBM312313
Synonyms:
2-[3-(3-Trifluoromethyl-[1,2,4]oxadiazol-5-yl)-4,5,6,7-tetrahydro-benzo[b]thiophen-2-ylcarbamoyl]-cyclopent-1-enecarboxylic acid | US9604977, Example 61
Type:
Small organic molecule
Emp. Form.:
C18H16F3N3O4S
Mol. Mass.:
427.398
SMILES:
OC(=O)C1=C(CCC1)C(=O)Nc1sc2CCCCc2c1-c1nc(no1)C(F)(F)F
: