Target
Fatty acid-binding protein, adipocyte
Ligand
BDBM312331
Substrate
Meas. Tech.
Time Resolved-Fluorescence Energy Transfer (TR-FRET) Assay
IC50
20.0±n/a nM
Citation
 Buettelmann, BCeccarelli, SMKuehne, HKuhn, BNeidhart, WObst Sander, URichter, H Bicyclic thiophenylamide compounds US Patent  US9604977 Publication Date 3/28/2017 
Target
Name:
Fatty acid-binding protein, adipocyte
Synonyms:
A-FABP ALBP FABP4 Fatty acid binding protein adipocyte Fatty acid-binding protein 4 (FABP4)
Type:
Enzyme
Mol. Mass.:
14719.23
Organism:
Homo sapiens (Human)
Description:
P15090
Residue:
132
  
Inhibitor
Name:
BDBM312331
Synonyms:
2-[3-(4-Methyl-oxazol-2-yl)-4,7-dihydro-5H-thieno[2,3-c]pyran-2-ylcarbamoyl]-cyclopent-1-enecarboxylic acid | US9604977, Example 78
Type:
Small organic molecule
Emp. Form.:
C18H18N2O5S
Mol. Mass.:
374.411
SMILES:
Cc1coc(n1)-c1c(NC(=O)C2=C(CCC2)C(O)=O)sc2COCCc12
: