Target
Fatty acid-binding protein, adipocyte
Ligand
BDBM312346
Substrate
Meas. Tech.
Time Resolved-Fluorescence Energy Transfer (TR-FRET) Assay
IC50
20.0±n/a nM
Citation
 Buettelmann, BCeccarelli, SMKuehne, HKuhn, BNeidhart, WObst Sander, URichter, H Bicyclic thiophenylamide compounds US Patent  US9604977 Publication Date 3/28/2017 
Target
Name:
Fatty acid-binding protein, adipocyte
Synonyms:
A-FABP ALBP FABP4 Fatty acid binding protein adipocyte Fatty acid-binding protein 4 (FABP4)
Type:
Enzyme
Mol. Mass.:
14719.23
Organism:
Homo sapiens (Human)
Description:
P15090
Residue:
132
  
Inhibitor
Name:
BDBM312346
Synonyms:
2-[3-(3-Cyclopropyl-[1,2,4]oxadiazol-5-yl)-6-methyl-4,5,6,7-tetrahydro-benzo[b]thiophen-2-ylcarbamoyl]-cyclohex-1-enecarboxylic acid | US9604977, Example 92
Type:
Small organic molecule
Emp. Form.:
C22H25N3O4S
Mol. Mass.:
427.517
SMILES:
CC1CCc2c(C1)sc(NC(=O)C1=C(CCCC1)C(O)=O)c2-c1nc(no1)C1CC1
: